Help, Error making VRui-3.1-003

Home Forums AR Sandbox Forum Help, Error making VRui-3.1-003

Viewing 2 posts - 1 through 2 (of 2 total)
  • Author
    Posts
  • #100992
    jimcanswim
    Participant

    Hi, I’m brand new to this and trying to install. I get the following error on my MAC when trying to make the above file. Can anyone help please??

    Compiling Geometry/Vector.cpp…
    Linking /Users/andrew/SRC/Vrui-3.1-003/lib/libGeometry.g++-3.3.1.dylib…
    Compiling GL/GLScalarLimits.cpp…
    In file included from GL/GLScalarLimits.cpp:24:
    /Users/andrew/SRC/Vrui-3.1-003/GL/GLScalarLimits.h:27:10: fatal error:
    ‘GL/gl.h’ file not found
    #include <GL/gl.h>
    ^
    1 error generated.
    make: *** [o/g++-3.g0.O3/GL/GLScalarLimits.o] Error 1
    Andrews-MacBook-Pro:Vrui-3.1-003 andrew$ make install
    Installing header files in /Users/andrew/Vrui-3.1/include…
    Installing libraries in /Users/andrew/Vrui-3.1/lib…
    install: /Users/andrew/SRC/Vrui-3.1-003/lib/libGLWrappers.g++-3.3.1.dylib: No such file or directory
    make: *** [install] Error 71

    Please Please help.

    #100993
    jimcanswim
    Participant

    Now, I’m getting this error:

    Compiling GL/GLScalarLimits.cpp…
    In file included from GL/GLScalarLimits.cpp:24:
    /Users/andrew/SRC/Vrui-3.1-003/GL/GLScalarLimits.h:27:10: fatal error:
    ‘GL/gl.h’ file not found
    #include <GL/gl.h>
    ^
    1 error generated.
    make: *** [o/g++-3.g0.O3/GL/GLScalarLimits.o] Error 1

Viewing 2 posts - 1 through 2 (of 2 total)
  • You must be logged in to reply to this topic.

Comments are closed.